﻿2026-07-27T07:16:24.9723277Z ##[group]Run cargo nextest run --workspace --no-fail-fast -E '(package(spt-daemon) & kind(test) & binary(/^(attach|brain_swap|broker|budget|conn_blackhole_lifecycle|controller_lease|daemon_e2e|daemon_lifecycle_real_brain|digest|dispatch|driven_by_selfheal|endpoint_lifecycle|endpoint_survival|handoff|idempotent|inject_control_wedge|input_ack_deadlock|mesh_recovery|net_worker_starve|redispatch|redispatch_stall|registry_lifecycle|render_lifecycle|resize_geometry_epoch|resize_presentation_barrier|restart_replay_lifetime|resume|shellchan|spawn_truth|transport_death_eof|two_origin_spanning|twohost)$/)) | (package(spt) & kind(test) & binary(/^(attach_wedge_e2e|bind_cwd_project_e2e|bind_honest_cross_perch_e2e|brain_respawn_rename|brain_split|brain_survive|daemon_refresh_e2e|dummy_harness_e2e|endpoint_teardown_authority_e2e|gateway_owner_shell_e2e|job_escape_e2e|live_adapt_translation_swap_e2e|livehost_bootgate_e2e|multi_subnet_bringup_e2e|n1_pairing|oneliner_e2e|projindex_reader_e2e|projindex_writer_e2e|rc_attach_truth|resume_template_e2e|run_no_dup_session_e2e)$/)) | (package(spt-term) & kind(test))'
2026-07-27T07:16:24.9728039Z [36;1mcargo nextest run --workspace --no-fail-fast -E '(package(spt-daemon) & kind(test) & binary(/^(attach|brain_swap|broker|budget|conn_blackhole_lifecycle|controller_lease|daemon_e2e|daemon_lifecycle_real_brain|digest|dispatch|driven_by_selfheal|endpoint_lifecycle|endpoint_survival|handoff|idempotent|inject_control_wedge|input_ack_deadlock|mesh_recovery|net_worker_starve|redispatch|redispatch_stall|registry_lifecycle|render_lifecycle|resize_geometry_epoch|resize_presentation_barrier|restart_replay_lifetime|resume|shellchan|spawn_truth|transport_death_eof|two_origin_spanning|twohost)$/)) | (package(spt) & kind(test) & binary(/^(attach_wedge_e2e|bind_cwd_project_e2e|bind_honest_cross_perch_e2e|brain_respawn_rename|brain_split|brain_survive|daemon_refresh_e2e|dummy_harness_e2e|endpoint_teardown_authority_e2e|gateway_owner_shell_e2e|job_escape_e2e|live_adapt_translation_swap_e2e|livehost_bootgate_e2e|multi_subnet_bringup_e2e|n1_pairing|oneliner_e2e|projindex_reader_e2e|projindex_writer_e2e|rc_attach_truth|resume_template_e2e|run_no_dup_session_e2e)$/)) | (package(spt-term) & kind(test))'[0m
2026-07-27T07:16:24.9735782Z shell: C:\Program Files\PowerShell\7\pwsh.EXE -command ". '{0}'"
2026-07-27T07:16:24.9736028Z env:
2026-07-27T07:16:24.9736193Z   SPT_ATTACH_GATE_WATCHDOG_MS: 120000
2026-07-27T07:16:24.9736453Z   SPT_ATTACH_IPC_DEADLINE_MS: 30000
2026-07-27T07:16:24.9736924Z   SPT_CI_TEST_TMP: C:\actions-runner\_work\_temp\spt-test-tmp-30240220441-1-b209867a25564ac4ac9e0e3073caf79c
2026-07-27T07:16:24.9737586Z   TEMP: C:\actions-runner\_work\_temp\spt-test-tmp-30240220441-1-b209867a25564ac4ac9e0e3073caf79c
2026-07-27T07:16:24.9738127Z   TMP: C:\actions-runner\_work\_temp\spt-test-tmp-30240220441-1-b209867a25564ac4ac9e0e3073caf79c
2026-07-27T07:16:24.9738526Z ##[endgroup]
2026-07-27T07:16:25.4929396Z     Blocking waiting for file lock on package cache
2026-07-27T07:16:48.0573905Z     Finished `test` profile [unoptimized + debuginfo] target(s) in 22.12s
2026-07-27T07:17:28.5376900Z ────────────
2026-07-27T07:17:28.5377221Z  Nextest run ID 0cdd2118-412b-4eb9-8b53-3aeda836805f with nextest profile: default
2026-07-27T07:17:28.5377539Z     Starting 180 tests across 62 binaries (106 binaries skipped)
2026-07-27T07:17:35.7507464Z         PASS [   7.212s] (  1/180) spt::attach_wedge_e2e attach_wedge_dead_child_plus_dropped_pump_does_not_wedge_the_broker
2026-07-27T07:17:38.0008698Z         PASS [   2.250s] (  2/180) spt::bind_cwd_project_e2e endpoint_run_records_cwd_and_appears_under_its_project
2026-07-27T07:17:39.8974006Z         PASS [   1.896s] (  3/180) spt::bind_honest_cross_perch_e2e cross_perch_dead_owner_repin_is_refused_no_contamination
2026-07-27T07:17:57.1480621Z         PASS [  17.251s] (  4/180) spt::brain_respawn_rename brain_respawns_onto_applied_bytes_after_in_place_rename
2026-07-27T07:18:04.9057598Z         PASS [   7.758s] (  5/180) spt::brain_split broker_survives_brain_kill_and_respawns_it
2026-07-27T07:18:13.8615519Z         FAIL [   8.953s] (  6/180) spt::brain_split seed_anchor_survives_brain_cycle
2026-07-27T07:18:13.8616165Z   stdout ───
2026-07-27T07:18:13.8616300Z 
2026-07-27T07:18:13.8616389Z     running 1 test
2026-07-27T07:18:13.8616639Z     test seed_anchor_survives_brain_cycle ... FAILED
2026-07-27T07:18:13.8616885Z 
2026-07-27T07:18:13.8617054Z     failures:
2026-07-27T07:18:13.8617224Z 
2026-07-27T07:18:13.8617299Z     failures:
2026-07-27T07:18:13.8617486Z         seed_anchor_survives_brain_cycle
2026-07-27T07:18:13.8617652Z 
2026-07-27T07:18:13.8617834Z     test result: FAILED. 0 passed; 1 failed; 0 ignored; 0 measured; 1 filtered out; finished in 8.94s
2026-07-27T07:18:13.8618151Z 
2026-07-27T07:18:13.8618280Z   stderr ───
2026-07-27T07:18:13.8618348Z 
2026-07-27T07:18:13.8618540Z     thread 'seed_anchor_survives_brain_cycle' (41628) panicked at crates\spt\tests\brain_split.rs:135:9:
2026-07-27T07:18:13.8618945Z     seed anchor dropped during a brain respawn — it must not ride the brain
2026-07-27T07:18:13.8619271Z     note: run with `RUST_BACKTRACE=1` environment variable to display a backtrace
2026-07-27T07:18:13.8619450Z 
2026-07-27T07:18:13.8808963Z         FAIL [   0.019s] (  7/180) spt::brain_survive pty_and_quic_survive_brain_process_restart_onto_swapped_binary
2026-07-27T07:18:13.8809398Z   stdout ───
2026-07-27T07:18:13.8809474Z 
2026-07-27T07:18:13.8809522Z     running 1 test
2026-07-27T07:18:13.8809730Z     test pty_and_quic_survive_brain_process_restart_onto_swapped_binary ... FAILED
2026-07-27T07:18:13.8809920Z 
2026-07-27T07:18:13.8809962Z     failures:
2026-07-27T07:18:13.8810031Z 
2026-07-27T07:18:13.8810071Z     failures:
2026-07-27T07:18:13.8810237Z         pty_and_quic_survive_brain_process_restart_onto_swapped_binary
2026-07-27T07:18:13.8810396Z 
2026-07-27T07:18:13.8810550Z     test result: FAILED. 0 passed; 1 failed; 0 ignored; 0 measured; 0 filtered out; finished in 0.00s
2026-07-27T07:18:13.8810765Z 
2026-07-27T07:18:13.8810840Z   stderr ───
2026-07-27T07:18:13.8810910Z 
2026-07-27T07:18:13.8811146Z     thread 'pty_and_quic_survive_brain_process_restart_onto_swapped_binary' (29128) panicked at crates\spt\tests\brain_survive.rs:209:41:
2026-07-27T07:18:13.8811623Z     stage fixture A: Os { code: 112, kind: StorageFull, message: "There is not enough space on the disk." }
2026-07-27T07:18:13.8811962Z     note: run with `RUST_BACKTRACE=1` environment variable to display a backtrace
2026-07-27T07:18:13.8812135Z 
2026-07-27T07:18:13.8992534Z         FAIL [   0.018s] (  8/180) spt::daemon_refresh_e2e daemon_refresh_cycles_brain_while_hosted_endpoint_survives
2026-07-27T07:18:13.8992919Z   stdout ───
2026-07-27T07:18:13.8992987Z 
2026-07-27T07:18:13.8993040Z     running 1 test
2026-07-27T07:18:13.8993240Z     test daemon_refresh_cycles_brain_while_hosted_endpoint_survives ... FAILED
2026-07-27T07:18:13.8993422Z 
2026-07-27T07:18:13.8993470Z     failures:
2026-07-27T07:18:13.8993533Z 
2026-07-27T07:18:13.8993603Z     failures:
2026-07-27T07:18:13.8993758Z         daemon_refresh_cycles_brain_while_hosted_endpoint_survives
2026-07-27T07:18:13.8993916Z 
2026-07-27T07:18:13.8994073Z     test result: FAILED. 0 passed; 1 failed; 0 ignored; 0 measured; 0 filtered out; finished in 0.00s
2026-07-27T07:18:13.8994297Z 
2026-07-27T07:18:13.8994359Z   stderr ───
2026-07-27T07:18:13.8994427Z 
2026-07-27T07:18:13.8994729Z     thread 'daemon_refresh_cycles_brain_while_hosted_endpoint_survives' (8292) panicked at crates\spt\tests\daemon_refresh_e2e.rs:115:42:
2026-07-27T07:18:13.8995420Z     stage the psyche binary fixture: Os { code: 112, kind: StorageFull, message: "There is not enough space on the disk." }
2026-07-27T07:18:13.8995804Z     note: run with `RUST_BACKTRACE=1` environment variable to display a backtrace
2026-07-27T07:18:13.8995991Z 
2026-07-27T07:18:13.9163376Z         FAIL [   0.017s] (  9/180) spt::dummy_harness_e2e endpoint_run_attach_awaits_online_before_attaching
2026-07-27T07:18:13.9163767Z   stdout ───
2026-07-27T07:18:13.9164430Z 
2026-07-27T07:18:13.9164485Z     running 1 test
2026-07-27T07:18:13.9164666Z     test endpoint_run_attach_awaits_online_before_attaching ... FAILED
2026-07-27T07:18:13.9164836Z 
2026-07-27T07:18:13.9164884Z     failures:
2026-07-27T07:18:13.9164947Z 
2026-07-27T07:18:13.9164995Z     failures:
2026-07-27T07:18:13.9165137Z         endpoint_run_attach_awaits_online_before_attaching
2026-07-27T07:18:13.9165269Z 
2026-07-27T07:18:13.9165450Z     test result: FAILED. 0 passed; 1 failed; 0 ignored; 0 measured; 1 filtered out; finished in 0.00s
2026-07-27T07:18:13.9165671Z 
2026-07-27T07:18:13.9165750Z   stderr ───
2026-07-27T07:18:13.9165816Z 
2026-07-27T07:18:13.9166048Z     thread 'endpoint_run_attach_awaits_online_before_attaching' (40440) panicked at crates\spt\tests\dummy_harness_e2e.rs:392:42:
2026-07-27T07:18:13.9166528Z     stage the psyche binary fixture: Os { code: 112, kind: StorageFull, message: "There is not enough space on the disk." }
2026-07-27T07:18:13.9166907Z     note: run with `RUST_BACKTRACE=1` environment variable to display a backtrace
2026-07-27T07:18:13.9167086Z 
2026-07-27T07:18:13.9324619Z         FAIL [   0.016s] ( 10/180) spt::dummy_harness_e2e endpoint_run_brings_up_a_long_lived_dummy_harness_and_rc_attaches
2026-07-27T07:18:13.9325560Z   stdout ───
2026-07-27T07:18:13.9325680Z 
2026-07-27T07:18:13.9325762Z     running 1 test
2026-07-27T07:18:13.9326111Z     test endpoint_run_brings_up_a_long_lived_dummy_harness_and_rc_attaches ... FAILED
2026-07-27T07:18:13.9326445Z 
2026-07-27T07:18:13.9326518Z     failures:
2026-07-27T07:18:13.9326631Z 
2026-07-27T07:18:13.9326695Z     failures:
2026-07-27T07:18:13.9326953Z         endpoint_run_brings_up_a_long_lived_dummy_harness_and_rc_attaches
2026-07-27T07:18:13.9327234Z 
2026-07-27T07:18:13.9327482Z     test result: FAILED. 0 passed; 1 failed; 0 ignored; 0 measured; 1 filtered out; finished in 0.00s
2026-07-27T07:18:13.9327845Z 
2026-07-27T07:18:13.9327953Z   stderr ───
2026-07-27T07:18:13.9328075Z 
2026-07-27T07:18:13.9328495Z     thread 'endpoint_run_brings_up_a_long_lived_dummy_harness_and_rc_attaches' (21728) panicked at crates\spt\tests\dummy_harness_e2e.rs:131:42:
2026-07-27T07:18:13.9329366Z     stage the psyche binary fixture: Os { code: 112, kind: StorageFull, message: "There is not enough space on the disk." }
2026-07-27T07:18:13.9329931Z     note: run with `RUST_BACKTRACE=1` environment variable to display a backtrace
2026-07-27T07:18:13.9330232Z 
2026-07-27T07:18:13.9585948Z         FAIL [   0.026s] ( 11/180) spt::endpoint_teardown_authority_e2e shutdown_reaps_the_hosted_subtree_it_reports_suspending
2026-07-27T07:18:13.9586680Z   stdout ───
2026-07-27T07:18:13.9586788Z 
2026-07-27T07:18:13.9586862Z     running 1 test
2026-07-27T07:18:13.9587159Z     test shutdown_reaps_the_hosted_subtree_it_reports_suspending ... FAILED
2026-07-27T07:18:13.9587426Z 
2026-07-27T07:18:13.9587474Z     failures:
2026-07-27T07:18:13.9587545Z 
2026-07-27T07:18:13.9587602Z     failures:
2026-07-27T07:18:13.9587810Z         shutdown_reaps_the_hosted_subtree_it_reports_suspending
2026-07-27T07:18:13.9588055Z 
2026-07-27T07:18:13.9588296Z     test result: FAILED. 0 passed; 1 failed; 0 ignored; 0 measured; 1 filtered out; finished in 0.01s
2026-07-27T07:18:13.9588674Z 
2026-07-27T07:18:13.9588802Z   stderr ───
2026-07-27T07:18:13.9588908Z 
2026-07-27T07:18:13.9589213Z     thread 'shutdown_reaps_the_hosted_subtree_it_reports_suspending' (15192) panicked at crates\spt\tests\endpoint_teardown_authority_e2e.rs:291:46:
2026-07-27T07:18:13.9589990Z     stage the psyche binary fixture: Os { code: 112, kind: StorageFull, message: "There is not enough space on the disk." }
2026-07-27T07:18:13.9590604Z     note: run with `RUST_BACKTRACE=1` environment variable to display a backtrace
2026-07-27T07:18:13.9590904Z 
2026-07-27T07:18:13.9752931Z         FAIL [   0.017s] ( 12/180) spt::endpoint_teardown_authority_e2e stop_reaps_the_hosted_subtree_and_run_recovers_the_endpoint
2026-07-27T07:18:13.9753822Z   stdout ───
2026-07-27T07:18:13.9753925Z 
2026-07-27T07:18:13.9753997Z     running 1 test
2026-07-27T07:18:13.9754299Z     test stop_reaps_the_hosted_subtree_and_run_recovers_the_endpoint ... FAILED
2026-07-27T07:18:13.9754580Z 
2026-07-27T07:18:13.9754657Z     failures:
2026-07-27T07:18:13.9754754Z 
2026-07-27T07:18:13.9754816Z     failures:
2026-07-27T07:18:13.9755050Z         stop_reaps_the_hosted_subtree_and_run_recovers_the_endpoint
2026-07-27T07:18:13.9755268Z 
2026-07-27T07:18:13.9755527Z     test result: FAILED. 0 passed; 1 failed; 0 ignored; 0 measured; 1 filtered out; finished in 0.01s
2026-07-27T07:18:13.9755883Z 
2026-07-27T07:18:13.9756001Z   stderr ───
2026-07-27T07:18:13.9756106Z 
2026-07-27T07:18:13.9756539Z     thread 'stop_reaps_the_hosted_subtree_and_run_recovers_the_endpoint' (8820) panicked at crates\spt\tests\endpoint_teardown_authority_e2e.rs:291:46:
2026-07-27T07:18:13.9757308Z     stage the psyche binary fixture: Os { code: 112, kind: StorageFull, message: "There is not enough space on the disk." }
2026-07-27T07:18:13.9757885Z     note: run with `RUST_BACKTRACE=1` environment variable to display a backtrace
2026-07-27T07:18:13.9758067Z 
2026-07-27T07:18:16.7626448Z         PASS [   2.787s] ( 13/180) spt::gateway_owner_shell_e2e gateway_typed_owner_owns_a_shell_on_every_path_keyed_on_id
2026-07-27T07:18:20.5718918Z         PASS [   3.809s] ( 14/180) spt::job_escape_e2e win::cold_start_daemon_escapes_kill_on_close_job_via_wmi
2026-07-27T07:18:23.5395287Z         PASS [   2.968s] ( 15/180) spt::job_escape_e2e win::wmi_daemon_run_has_no_conhost_window
2026-07-27T07:18:23.5575853Z         FAIL [   0.018s] ( 16/180) spt::live_adapt_translation_swap_e2e adapter_apply_for_foreign_adapter_leaves_live_endpoint_untouched
2026-07-27T07:18:23.5576374Z   stdout ───
2026-07-27T07:18:23.5576446Z 
2026-07-27T07:18:23.5576503Z     running 1 test
2026-07-27T07:18:23.5576721Z     test adapter_apply_for_foreign_adapter_leaves_live_endpoint_untouched ... FAILED
2026-07-27T07:18:23.5576951Z 
2026-07-27T07:18:23.5577000Z     failures:
2026-07-27T07:18:23.5577064Z 
2026-07-27T07:18:23.5577112Z     failures:
2026-07-27T07:18:23.5577286Z         adapter_apply_for_foreign_adapter_leaves_live_endpoint_untouched
2026-07-27T07:18:23.5577461Z 
2026-07-27T07:18:23.5577625Z     test result: FAILED. 0 passed; 1 failed; 0 ignored; 0 measured; 3 filtered out; finished in 0.00s
2026-07-27T07:18:23.5577851Z 
2026-07-27T07:18:23.5577913Z   stderr ───
2026-07-27T07:18:23.5577984Z 
2026-07-27T07:18:23.5578275Z     thread 'adapter_apply_for_foreign_adapter_leaves_live_endpoint_untouched' (45392) panicked at crates\spt\tests\live_adapt_translation_swap_e2e.rs:859:42:
2026-07-27T07:18:23.5578830Z     stage the psyche binary fixture: Os { code: 112, kind: StorageFull, message: "There is not enough space on the disk." }
2026-07-27T07:18:23.5579223Z     note: run with `RUST_BACKTRACE=1` environment variable to display a backtrace
2026-07-27T07:18:23.5579414Z 
2026-07-27T07:18:23.5691371Z         FAIL [   0.011s] ( 17/180) spt::live_adapt_translation_swap_e2e adapter_apply_swaps_composite_profile_endpoint_matched_on_parent
2026-07-27T07:18:23.5692086Z   stdout ───
2026-07-27T07:18:23.5692229Z 
2026-07-27T07:18:23.5692307Z     running 1 test
2026-07-27T07:18:23.5692682Z     test adapter_apply_swaps_composite_profile_endpoint_matched_on_parent ... FAILED
2026-07-27T07:18:23.5693035Z 
2026-07-27T07:18:23.5693112Z     failures:
2026-07-27T07:18:23.5693221Z 
2026-07-27T07:18:23.5693294Z     failures:
2026-07-27T07:18:23.5693563Z         adapter_apply_swaps_composite_profile_endpoint_matched_on_parent
2026-07-27T07:18:23.5693851Z 
2026-07-27T07:18:23.5694115Z     test result: FAILED. 0 passed; 1 failed; 0 ignored; 0 measured; 3 filtered out; finished in 0.00s
2026-07-27T07:18:23.5694485Z 
2026-07-27T07:18:23.5694617Z   stderr ───
2026-07-27T07:18:23.5694713Z 
2026-07-27T07:18:23.5695208Z     thread 'adapter_apply_swaps_composite_profile_endpoint_matched_on_parent' (35380) panicked at crates\spt\tests\live_adapt_translation_swap_e2e.rs:602:42:
2026-07-27T07:18:23.5696122Z     stage the psyche binary fixture: Os { code: 112, kind: StorageFull, message: "There is not enough space on the disk." }
2026-07-27T07:18:23.5696521Z     note: run with `RUST_BACKTRACE=1` environment variable to display a backtrace
2026-07-27T07:18:23.5696715Z 
2026-07-27T07:18:23.5813269Z         FAIL [   0.012s] ( 18/180) spt::live_adapt_translation_swap_e2e adapter_apply_swaps_locked_translation_binary_without_restarting_endpoint
2026-07-27T07:18:23.5813912Z   stdout ───
2026-07-27T07:18:23.5813994Z 
2026-07-27T07:18:23.5814041Z     running 1 test
2026-07-27T07:18:23.5814279Z     test adapter_apply_swaps_locked_translation_binary_without_restarting_endpoint ... FAILED
2026-07-27T07:18:23.5814505Z 
2026-07-27T07:18:23.5814549Z     failures:
2026-07-27T07:18:23.5814620Z 
2026-07-27T07:18:23.5814663Z     failures:
2026-07-27T07:18:23.5814855Z         adapter_apply_swaps_locked_translation_binary_without_restarting_endpoint
2026-07-27T07:18:23.5815060Z 
2026-07-27T07:18:23.5815219Z     test result: FAILED. 0 passed; 1 failed; 0 ignored; 0 measured; 3 filtered out; finished in 0.00s
2026-07-27T07:18:23.5815683Z 
2026-07-27T07:18:23.5815759Z   stderr ───
2026-07-27T07:18:23.5815824Z 
2026-07-27T07:18:23.5816138Z     thread 'adapter_apply_swaps_locked_translation_binary_without_restarting_endpoint' (29208) panicked at crates\spt\tests\live_adapt_translation_swap_e2e.rs:162:42:
2026-07-27T07:18:23.5816714Z     stage the psyche binary fixture: Os { code: 112, kind: StorageFull, message: "There is not enough space on the disk." }
2026-07-27T07:18:23.5817116Z     note: run with `RUST_BACKTRACE=1` environment variable to display a backtrace
2026-07-27T07:18:23.5817297Z 
2026-07-27T07:18:25.3885446Z         PASS [   1.807s] ( 19/180) spt::live_adapt_translation_swap_e2e adapter_apply_with_no_matching_session_still_swaps
2026-07-27T07:18:25.4065967Z         FAIL [   0.018s] ( 20/180) spt::livehost_bootgate_e2e cold_start_does_not_revive_a_sessionless_online_latched_perch
2026-07-27T07:18:25.4066715Z   stdout ───
2026-07-27T07:18:25.4066836Z 
2026-07-27T07:18:25.4066918Z     running 1 test
2026-07-27T07:18:25.4067306Z     test cold_start_does_not_revive_a_sessionless_online_latched_perch ... FAILED
2026-07-27T07:18:25.4067656Z 
2026-07-27T07:18:25.4067721Z     failures:
2026-07-27T07:18:25.4067837Z 
2026-07-27T07:18:25.4067905Z     failures:
2026-07-27T07:18:25.4068163Z         cold_start_does_not_revive_a_sessionless_online_latched_perch
2026-07-27T07:18:25.4068421Z 
2026-07-27T07:18:25.4068685Z     test result: FAILED. 0 passed; 1 failed; 0 ignored; 0 measured; 0 filtered out; finished in 0.00s
2026-07-27T07:18:25.4069051Z 
2026-07-27T07:18:25.4069175Z   stderr ───
2026-07-27T07:18:25.4069293Z 
2026-07-27T07:18:25.4069725Z     thread 'cold_start_does_not_revive_a_sessionless_online_latched_perch' (40156) panicked at crates\spt\tests\livehost_bootgate_e2e.rs:87:42:
2026-07-27T07:18:25.4070647Z     stage the psyche binary fixture: Os { code: 112, kind: StorageFull, message: "There is not enough space on the disk." }
2026-07-27T07:18:25.4071292Z     note: run with `RUST_BACKTRACE=1` environment variable to display a backtrace
2026-07-27T07:18:25.4071596Z 
2026-07-27T07:18:25.4256533Z         FAIL [   0.019s] ( 21/180) spt::multi_subnet_bringup_e2e fresh_unbound_is_attachable_before_bind
2026-07-27T07:18:25.4256902Z   stdout ───
2026-07-27T07:18:25.4256971Z 
2026-07-27T07:18:25.4257024Z     running 1 test
2026-07-27T07:18:25.4257190Z     test fresh_unbound_is_attachable_before_bind ... FAILED
2026-07-27T07:18:25.4257331Z 
2026-07-27T07:18:25.4257377Z     failures:
2026-07-27T07:18:25.4257440Z 
2026-07-27T07:18:25.4257485Z     failures:
2026-07-27T07:18:25.4257611Z         fresh_unbound_is_attachable_before_bind
2026-07-27T07:18:25.4257728Z 
2026-07-27T07:18:25.4257899Z     test result: FAILED. 0 passed; 1 failed; 0 ignored; 0 measured; 2 filtered out; finished in 0.00s
2026-07-27T07:18:25.4258743Z 
2026-07-27T07:18:25.4258819Z   stderr ───
2026-07-27T07:18:25.4258884Z 
2026-07-27T07:18:25.4259113Z     thread 'fresh_unbound_is_attachable_before_bind' (15516) panicked at crates\spt\tests\multi_subnet_bringup_e2e.rs:126:41:
2026-07-27T07:18:25.4259621Z     stage the psyche binary fixture: Os { code: 112, kind: StorageFull, message: "There is not enough space on the disk." }
2026-07-27T07:18:25.4260011Z     note: run with `RUST_BACKTRACE=1` environment variable to display a backtrace
2026-07-27T07:18:25.4260197Z 
2026-07-27T07:18:25.4370227Z         FAIL [   0.011s] ( 22/180) spt::multi_subnet_bringup_e2e multi_subnet_refuses_without_subnet_then_homes_and_binds
2026-07-27T07:18:25.4370846Z   stdout ───
2026-07-27T07:18:25.4370961Z 
2026-07-27T07:18:25.4371039Z     running 1 test
2026-07-27T07:18:25.4371386Z     test multi_subnet_refuses_without_subnet_then_homes_and_binds ... FAILED
2026-07-27T07:18:25.4371736Z 
2026-07-27T07:18:25.4371807Z     failures:
2026-07-27T07:18:25.4371936Z 
2026-07-27T07:18:25.4372000Z     failures:
2026-07-27T07:18:25.4372264Z         multi_subnet_refuses_without_subnet_then_homes_and_binds
2026-07-27T07:18:25.4372515Z 
2026-07-27T07:18:25.4373024Z     test result: FAILED. 0 passed; 1 failed; 0 ignored; 0 measured; 2 filtered out; finished in 0.00s
2026-07-27T07:18:25.4373403Z 
2026-07-27T07:18:25.4373532Z   stderr ───
2026-07-27T07:18:25.4373628Z 
2026-07-27T07:18:25.4374062Z     thread 'multi_subnet_refuses_without_subnet_then_homes_and_binds' (38604) panicked at crates\spt\tests\multi_subnet_bringup_e2e.rs:126:41:
2026-07-27T07:18:25.4374972Z     stage the psyche binary fixture: Os { code: 112, kind: StorageFull, message: "There is not enough space on the disk." }
2026-07-27T07:18:25.4375558Z     note: run with `RUST_BACKTRACE=1` environment variable to display a backtrace
2026-07-27T07:18:25.4375877Z 
2026-07-27T07:18:25.4499219Z         FAIL [   0.013s] ( 23/180) spt::multi_subnet_bringup_e2e single_subnet_control_auto_homes
2026-07-27T07:18:25.4499784Z   stdout ───
2026-07-27T07:18:25.4499906Z 
2026-07-27T07:18:25.4499980Z     running 1 test
2026-07-27T07:18:25.4500223Z     test single_subnet_control_auto_homes ... FAILED
2026-07-27T07:18:25.4500477Z 
2026-07-27T07:18:25.4500552Z     failures:
2026-07-27T07:18:25.4500671Z 
2026-07-27T07:18:25.4500742Z     failures:
2026-07-27T07:18:25.4500942Z         single_subnet_control_auto_homes
2026-07-27T07:18:25.4501129Z 
2026-07-27T07:18:25.4501407Z     test result: FAILED. 0 passed; 1 failed; 0 ignored; 0 measured; 2 filtered out; finished in 0.00s
2026-07-27T07:18:25.4501783Z 
2026-07-27T07:18:25.4501889Z   stderr ───
2026-07-27T07:18:25.4501997Z 
2026-07-27T07:18:25.4502323Z     thread 'single_subnet_control_auto_homes' (46708) panicked at crates\spt\tests\multi_subnet_bringup_e2e.rs:126:41:
2026-07-27T07:18:25.4503104Z     stage the psyche binary fixture: Os { code: 112, kind: StorageFull, message: "There is not enough space on the disk." }
2026-07-27T07:18:25.4503754Z     note: run with `RUST_BACKTRACE=1` environment variable to display a backtrace
2026-07-27T07:18:25.4504041Z 
2026-07-27T07:18:25.4640452Z         PASS [   0.014s] ( 24/180) spt::n1_pairing new_brain_serves_against_old_broker
2026-07-27T07:18:25.4911876Z         PASS [   0.027s] ( 25/180) spt::oneliner_e2e at_logon_task_launches_daemon_in_background_not_foreground
2026-07-27T07:18:25.4987009Z         PASS [   0.007s] ( 26/180) spt::oneliner_e2e install_script_against_staged_release
2026-07-27T07:18:28.9765836Z         PASS [   3.478s] ( 27/180) spt::projindex_reader_e2e readers_answer_from_daemon_maintained_index_with_zero_git
2026-07-27T07:18:35.5854355Z         PASS [   6.609s] ( 28/180) spt::projindex_writer_e2e writer_cold_warm_and_event_invalidation_against_live_daemon
2026-07-27T07:18:37.9337671Z         PASS [   2.348s] ( 29/180) spt::rc_attach_truth harness_only_refuses_truthfully_pre_stream
2026-07-27T07:18:37.9465262Z         FAIL [   0.013s] ( 30/180) spt::rc_attach_truth offline_row_over_live_session_attaches
2026-07-27T07:18:37.9466139Z   stdout ───
2026-07-27T07:18:37.9466252Z 
2026-07-27T07:18:37.9466328Z     running 1 test
2026-07-27T07:18:37.9466598Z     test offline_row_over_live_session_attaches ... FAILED
2026-07-27T07:18:37.9466853Z 
2026-07-27T07:18:37.9466915Z     failures:
2026-07-27T07:18:37.9467025Z 
2026-07-27T07:18:37.9467093Z     failures:
2026-07-27T07:18:37.9467294Z         offline_row_over_live_session_attaches
2026-07-27T07:18:37.9467483Z 
2026-07-27T07:18:37.9467770Z     test result: FAILED. 0 passed; 1 failed; 0 ignored; 0 measured; 5 filtered out; finished in 0.00s
2026-07-27T07:18:37.9468134Z 
2026-07-27T07:18:37.9468264Z   stderr ───
2026-07-27T07:18:37.9468369Z 
2026-07-27T07:18:37.9468687Z     thread 'offline_row_over_live_session_attaches' (26548) panicked at crates\spt\tests\rc_attach_truth.rs:121:41:
2026-07-27T07:18:37.9469485Z     stage the psyche binary fixture: Os { code: 112, kind: StorageFull, message: "There is not enough space on the disk." }
2026-07-27T07:18:37.9470131Z     note: run with `RUST_BACKTRACE=1` environment variable to display a backtrace
2026-07-27T07:18:37.9470403Z 
2026-07-27T07:18:39.7286560Z         PASS [   1.782s] ( 31/180) spt::rc_attach_truth offline_row_with_no_session_refuses
2026-07-27T07:18:39.7430651Z         FAIL [   0.014s] ( 32/180) spt::rc_attach_truth rc_owned_display_carries_no_pump_diagnostics
2026-07-27T07:18:39.7431264Z   stdout ───
2026-07-27T07:18:39.7431373Z 
2026-07-27T07:18:39.7431439Z     running 1 test
2026-07-27T07:18:39.7431705Z     test rc_owned_display_carries_no_pump_diagnostics ... FAILED
2026-07-27T07:18:39.7431977Z 
2026-07-27T07:18:39.7432052Z     failures:
2026-07-27T07:18:39.7432160Z 
2026-07-27T07:18:39.7432238Z     failures:
2026-07-27T07:18:39.7432460Z         rc_owned_display_carries_no_pump_diagnostics
2026-07-27T07:18:39.7432666Z 
2026-07-27T07:18:39.7432942Z     test result: FAILED. 0 passed; 1 failed; 0 ignored; 0 measured; 5 filtered out; finished in 0.00s
2026-07-27T07:18:39.7433316Z 
2026-07-27T07:18:39.7433434Z   stderr ───
2026-07-27T07:18:39.7433534Z 
2026-07-27T07:18:39.7433877Z     thread 'rc_owned_display_carries_no_pump_diagnostics' (40668) panicked at crates\spt\tests\rc_attach_truth.rs:121:41:
2026-07-27T07:18:39.7434428Z     stage the psyche binary fixture: Os { code: 112, kind: StorageFull, message: "There is not enough space on the disk." }
2026-07-27T07:18:39.7435068Z     note: run with `RUST_BACKTRACE=1` environment variable to display a backtrace
2026-07-27T07:18:39.7435386Z 
2026-07-27T07:18:39.7546352Z         FAIL [   0.011s] ( 33/180) spt::rc_attach_truth resume_never_bound_reads_unbound_and_attaches
2026-07-27T07:18:39.7546889Z   stdout ───
2026-07-27T07:18:39.7546999Z 
2026-07-27T07:18:39.7547065Z     running 1 test
2026-07-27T07:18:39.7547340Z     test resume_never_bound_reads_unbound_and_attaches ... FAILED
2026-07-27T07:18:39.7547608Z 
2026-07-27T07:18:39.7547679Z     failures:
2026-07-27T07:18:39.7547792Z 
2026-07-27T07:18:39.7547858Z     failures:
2026-07-27T07:18:39.7548091Z         resume_never_bound_reads_unbound_and_attaches
2026-07-27T07:18:39.7548306Z 
2026-07-27T07:18:39.7548710Z     test result: FAILED. 0 passed; 1 failed; 0 ignored; 0 measured; 5 filtered out; finished in 0.00s
2026-07-27T07:18:39.7549149Z 
2026-07-27T07:18:39.7549302Z   stderr ───
2026-07-27T07:18:39.7549430Z 
2026-07-27T07:18:39.7549799Z     thread 'resume_never_bound_reads_unbound_and_attaches' (18304) panicked at crates\spt\tests\rc_attach_truth.rs:121:41:
2026-07-27T07:18:39.7550615Z     stage the psyche binary fixture: Os { code: 112, kind: StorageFull, message: "There is not enough space on the disk." }
2026-07-27T07:18:39.7551277Z     note: run with `RUST_BACKTRACE=1` environment variable to display a backtrace
2026-07-27T07:18:39.7551590Z 
2026-07-27T07:18:39.7673190Z         FAIL [   0.013s] ( 34/180) spt::rc_attach_truth zombie_claim_refuses_never_attaches
2026-07-27T07:18:39.7673672Z   stdout ───
2026-07-27T07:18:39.7673773Z 
2026-07-27T07:18:39.7674117Z     running 1 test
2026-07-27T07:18:39.7674354Z     test zombie_claim_refuses_never_attaches ... FAILED
2026-07-27T07:18:39.7674587Z 
2026-07-27T07:18:39.7674661Z     failures:
2026-07-27T07:18:39.7674775Z 
2026-07-27T07:18:39.7674845Z     failures:
2026-07-27T07:18:39.7675034Z         zombie_claim_refuses_never_attaches
2026-07-27T07:18:39.7675220Z 
2026-07-27T07:18:39.7675483Z     test result: FAILED. 0 passed; 1 failed; 0 ignored; 0 measured; 5 filtered out; finished in 0.00s
2026-07-27T07:18:39.7675849Z 
2026-07-27T07:18:39.7675967Z   stderr ───
2026-07-27T07:18:39.7676074Z 
2026-07-27T07:18:39.7676383Z     thread 'zombie_claim_refuses_never_attaches' (44800) panicked at crates\spt\tests\rc_attach_truth.rs:121:41:
2026-07-27T07:18:39.7677136Z     stage the psyche binary fixture: Os { code: 112, kind: StorageFull, message: "There is not enough space on the disk." }
2026-07-27T07:18:39.7677777Z     note: run with `RUST_BACKTRACE=1` environment variable to display a backtrace
2026-07-27T07:18:39.7678103Z 
2026-07-27T07:18:39.7841597Z         FAIL [   0.017s] ( 35/180) spt::resume_template_e2e endpoint_run_resume_selects_resume_template_in_recorded_cwd
2026-07-27T07:18:39.7842431Z   stdout ───
2026-07-27T07:18:39.7842547Z 
2026-07-27T07:18:39.7842626Z     running 1 test
2026-07-27T07:18:39.7842967Z     test endpoint_run_resume_selects_resume_template_in_recorded_cwd ... FAILED
2026-07-27T07:18:39.7843296Z 
2026-07-27T07:18:39.7843363Z     failures:
2026-07-27T07:18:39.7843472Z 
2026-07-27T07:18:39.7843539Z     failures:
2026-07-27T07:18:39.7843790Z         endpoint_run_resume_selects_resume_template_in_recorded_cwd
2026-07-27T07:18:39.7844044Z 
2026-07-27T07:18:39.7844305Z     test result: FAILED. 0 passed; 1 failed; 0 ignored; 0 measured; 0 filtered out; finished in 0.00s
2026-07-27T07:18:39.7844670Z 
2026-07-27T07:18:39.7844790Z   stderr ───
2026-07-27T07:18:39.7844890Z 
2026-07-27T07:18:39.7845307Z     thread 'endpoint_run_resume_selects_resume_template_in_recorded_cwd' (31064) panicked at crates\spt\tests\resume_template_e2e.rs:158:42:
2026-07-27T07:18:39.7846201Z     stage the psyche binary fixture: Os { code: 112, kind: StorageFull, message: "There is not enough space on the disk." }
2026-07-27T07:18:39.7846795Z     note: run with `RUST_BACKTRACE=1` environment variable to display a backtrace
2026-07-27T07:18:39.7847383Z 
2026-07-27T07:18:39.8014958Z         FAIL [   0.017s] ( 36/180) spt::run_no_dup_session_e2e run_over_live_endpoint_never_mints_a_second_session
2026-07-27T07:18:39.8015548Z   stdout ───
2026-07-27T07:18:39.8015656Z 
2026-07-27T07:18:39.8015721Z     running 1 test
2026-07-27T07:18:39.8016039Z     test run_over_live_endpoint_never_mints_a_second_session ... FAILED
2026-07-27T07:18:39.8016357Z 
2026-07-27T07:18:39.8016430Z     failures:
2026-07-27T07:18:39.8016543Z 
2026-07-27T07:18:39.8016612Z     failures:
2026-07-27T07:18:39.8016846Z         run_over_live_endpoint_never_mints_a_second_session
2026-07-27T07:18:39.8017091Z 
2026-07-27T07:18:39.8017358Z     test result: FAILED. 0 passed; 1 failed; 0 ignored; 0 measured; 0 filtered out; finished in 0.00s
2026-07-27T07:18:39.8017728Z 
2026-07-27T07:18:39.8017834Z   stderr ───
2026-07-27T07:18:39.8017944Z 
2026-07-27T07:18:39.8018338Z     thread 'run_over_live_endpoint_never_mints_a_second_session' (23580) panicked at crates\spt\tests\run_no_dup_session_e2e.rs:167:42:
2026-07-27T07:18:39.8019195Z     stage the psyche binary fixture: Os { code: 112, kind: StorageFull, message: "There is not enough space on the disk." }
2026-07-27T07:18:39.8019868Z     note: run with `RUST_BACKTRACE=1` environment variable to display a backtrace
2026-07-27T07:18:39.8020141Z 
2026-07-27T07:18:39.9971350Z         PASS [   0.196s] ( 37/180) spt-daemon::attach attach_registers_remote_drive_detection
2026-07-27T07:18:40.1504643Z         PASS [   0.153s] ( 38/180) spt-daemon::attach attach_survives_target_brain_restart_exactly_once
2026-07-27T07:18:40.2315340Z         PASS [   0.081s] ( 39/180) spt-daemon::attach broker_spawns_the_pty_child_in_the_requested_cwd
2026-07-27T07:18:40.3165760Z         PASS [   0.085s] ( 40/180) spt-daemon::attach controller_restart_with_viewer_no_displace_and_viewer_survives
2026-07-27T07:18:40.3770030Z         PASS [   0.060s] ( 41/180) spt-daemon::attach controller_viewer_matrix_and_loud_take
2026-07-27T07:18:40.4093652Z         PASS [   0.032s] ( 42/180) spt-daemon::attach handoff_seeds_resume_cursor_and_resubscribes_for_resume
2026-07-27T07:18:40.5007487Z         PASS [   0.091s] ( 43/180) spt-daemon::attach local_attach_via_loopback_conn_rides_the_same_pump
2026-07-27T07:18:40.5911343Z         PASS [   0.090s] ( 44/180) spt-daemon::attach loopback_attach_to_a_prepopulated_ring_delivers_without_deadlock
2026-07-27T07:18:40.6549385Z         PASS [   0.064s] ( 45/180) spt-daemon::attach loopback_self_dial_is_refused_local_uses_fallback_transport
2026-07-27T07:18:40.6906902Z         PASS [   0.036s] ( 46/180) spt-daemon::attach re_serve_resets_resume_cursor_after_a_pre_attached_consume
2026-07-27T07:18:40.8228445Z         PASS [   0.132s] ( 47/180) spt-daemon::attach remote_attach_drives_a_real_pty_cross_daemon
2026-07-27T07:18:40.9162102Z         PASS [   0.093s] ( 48/180) spt-daemon::attach resize_is_controller_exclusive
2026-07-27T07:18:41.0090379Z         PASS [   0.093s] ( 49/180) spt-daemon::attach same_origin_re_subscribe_does_not_displace
2026-07-27T07:18:41.1314855Z         PASS [   0.122s] ( 50/180) spt-daemon::attach spt_hosted_bringup_then_cross_node_attach_drives_the_pty
2026-07-27T07:18:41.5074763Z         PASS [   0.376s] ( 51/180) spt-daemon::attach wedged_viewer_does_not_stall_controller
2026-07-27T07:18:42.1705115Z         PASS [   0.663s] ( 52/180) spt-daemon::brain_swap brain_only_update_swaps_logic_with_zero_endpoint_interruption
2026-07-27T07:18:42.5532344Z         PASS [   0.383s] ( 53/180) spt-daemon::broker ack_false_input_suppresses_applied_frame
2026-07-27T07:18:43.2204320Z         PASS [   0.667s] ( 54/180) spt-daemon::broker broker_hosts_pty_child_streams_output_and_accepts_input
2026-07-27T07:18:43.9089435Z         PASS [   0.688s] ( 55/180) spt-daemon::broker controller_writer_reorder_consumer_view_stays_monotonic_and_session_live
2026-07-27T07:18:44.6094265Z         PASS [   0.700s] ( 56/180) spt-daemon::broker dead_session_subscribe_does_not_hang
2026-07-27T07:18:45.0181429Z         PASS [   0.409s] ( 57/180) spt-daemon::broker endpoint_keyed_inject_without_binary_spools_not_pty
2026-07-27T07:18:45.1732118Z         PASS [   0.155s] ( 58/180) spt-daemon::broker exactly_once_preserved_on_no_ack_path
2026-07-27T07:18:45.5904356Z         PASS [   0.417s] ( 59/180) spt-daemon::broker spawn_env_reaches_child
2026-07-27T07:18:46.0107262Z         PASS [   0.420s] ( 60/180) spt-daemon::broker wall_b_endpoint_run_env_then_send_spools
2026-07-27T07:18:46.0206431Z         PASS [   0.010s] ( 61/180) spt-daemon::budget measure_dormant_seat_budget
2026-07-27T07:18:47.0640573Z         PASS [   1.043s] ( 62/180) spt-daemon::conn_blackhole_lifecycle blackholed_controller_lifecycle_five_invariants
2026-07-27T07:18:49.1671612Z         PASS [   2.103s] ( 63/180) spt-daemon::controller_lease equal_lease_replay_stays_silent_and_never_self_displaces
2026-07-27T07:18:50.7724447Z         PASS [   1.605s] ( 64/180) spt-daemon::controller_lease revoke_terminates_a_wedged_incumbent_plain_control
2026-07-27T07:18:52.3622901Z         PASS [   1.590s] ( 65/180) spt-daemon::controller_lease revoke_terminates_a_wedged_incumbent_take
2026-07-27T07:18:52.7534096Z         PASS [   0.391s] ( 66/180) spt-daemon::controller_lease same_node_distinct_lease_take_displaces_loudly_and_completes_the_stream
2026-07-27T07:18:53.1391563Z         PASS [   0.386s] ( 67/180) spt-daemon::controller_lease same_node_newer_gen_plain_control_supersedes_loudly_and_completes_the_stream
2026-07-27T07:18:53.2474657Z         PASS [   0.108s] ( 68/180) spt-daemon::controller_lease stale_lease_input_and_resize_mutate_nothing_and_shell_injection_lands
2026-07-27T07:18:56.0252193Z         PASS [   2.778s] ( 69/180) spt-daemon::daemon_e2e daemon_hosts_lifecycle_and_survives_brain_restart
2026-07-27T07:19:02.3124898Z         PASS [   6.287s] ( 70/180) spt-daemon::daemon_lifecycle_real_brain real_brain_process_hosts_the_psyche_for_an_online_live_endpoint
2026-07-27T07:19:02.5758453Z         PASS [   0.263s] ( 71/180) spt-daemon::digest harness_hosted_digest_projects_and_pushes_deltas
2026-07-27T07:19:02.5941688Z         PASS [   0.018s] ( 72/180) spt-daemon::dispatch classify_routes_a_node_label_feed_to_registry
2026-07-27T07:19:03.1265202Z         PASS [   0.532s] ( 73/180) spt-daemon::dispatch dispatcher_applies_a_notif_feed_undriven
2026-07-27T07:19:03.3306881Z         PASS [   0.204s] ( 74/180) spt-daemon::dispatch dispatcher_funnels_wan_messages_undriven
2026-07-27T07:19:03.4862150Z         PASS [   0.155s] ( 75/180) spt-daemon::dispatch dispatcher_resolves_attach_by_endpoint_and_refuses_a_stale_endpoint
2026-07-27T07:19:03.7200716Z         PASS [   0.234s] ( 76/180) spt-daemon::dispatch dispatcher_serves_a_cross_node_shell_link
2026-07-27T07:19:03.8488723Z         PASS [   0.129s] ( 77/180) spt-daemon::dispatch dispatcher_serves_a_file_fetch_undriven
2026-07-27T07:19:04.0395837Z         PASS [   0.191s] ( 78/180) spt-daemon::dispatch dispatcher_serves_a_remote_drive_attach_undriven
2026-07-27T07:19:04.2393802Z         PASS [   0.200s] ( 79/180) spt-daemon::dispatch dispatcher_serves_a_subnet_serve_probe
2026-07-27T07:19:05.6528012Z         PASS [   1.413s] ( 80/180) spt-daemon::dispatch dispatcher_serves_a_sync_pull_undriven
2026-07-27T07:19:05.8029215Z         PASS [   0.150s] ( 81/180) spt-daemon::dispatch dispatcher_serves_an_update_pull_undriven
2026-07-27T07:19:06.0522726Z         PASS [   0.249s] ( 82/180) spt-daemon::dispatch dispatcher_surfaces_a_remote_won_notif_at_the_winning_node
2026-07-27T07:19:06.2334424Z         PASS [   0.181s] ( 83/180) spt-daemon::dispatch dispatcher_survives_an_unknown_stream
2026-07-27T07:19:06.7347800Z         PASS [   0.501s] ( 84/180) spt-daemon::driven_by_selfheal gap_a_live_session_controller_by_is_ambiguous_so_reconcile_must_not_clear
2026-07-27T07:19:06.8326585Z         PASS [   0.098s] ( 85/180) spt-daemon::driven_by_selfheal gap_b_sessionless_perch_reconcile_offlines_and_clears_driven_by
2026-07-27T07:19:06.9115666Z         PASS [   0.079s] ( 86/180) spt-daemon::endpoint_lifecycle dead_pid_hybrid_row_does_not_survive_reconcile
2026-07-27T07:19:07.0394982Z         PASS [   0.128s] ( 87/180) spt-daemon::endpoint_lifecycle definitive_death_normalizes_and_next_reconcile_emits_no_wake_resume
2026-07-27T07:19:08.1391343Z         PASS [   1.100s] ( 88/180) spt-daemon::endpoint_lifecycle poll_vs_reap_interleave_converges_to_cleared_stamps
2026-07-27T07:19:08.9876400Z         PASS [   0.848s] ( 89/180) spt-daemon::endpoint_lifecycle raw_viewport_close_frees_the_controller_full_chain_across_broker_restart
2026-07-27T07:19:09.2119125Z         PASS [   0.224s] ( 90/180) spt-daemon::endpoint_survival daemon_restart_reruns_a_previously_online_orphaned_endpoint
2026-07-27T07:19:09.4256189Z         PASS [   0.214s] ( 91/180) spt-daemon::endpoint_survival daemon_restart_resumes_a_ready_agent_controllable_orphan
2026-07-27T07:19:09.4569656Z         PASS [   0.031s] ( 92/180) spt-daemon::endpoint_survival reconcile_leaves_a_legitimate_live_pid_ready_listener_online
2026-07-27T07:19:09.5251795Z         PASS [   0.068s] ( 93/180) spt-daemon::endpoint_survival reconcile_terminally_offlines_a_sessionless_ready_agent_controllable_hybrid
2026-07-27T07:19:10.3509257Z         PASS [   0.826s] ( 94/180) spt-daemon::handoff brain_restart_survives_gaplessly_with_fresh_gen_start
2026-07-27T07:19:10.4043210Z         PASS [   0.053s] ( 95/180) spt-daemon::idempotent pty_writes_are_exactly_once_across_brain_crashes
2026-07-27T07:19:13.9358396Z         PASS [   3.531s] ( 96/180) spt-daemon::inject_control_wedge a_backed_up_controller_does_not_wedge_the_session
2026-07-27T07:19:16.8820756Z         PASS [   2.946s] ( 97/180) spt-daemon::inject_control_wedge a_journaled_input_wedge_does_not_starve_a_concurrent_rc_attach
2026-07-27T07:19:18.0381022Z         PASS [   1.156s] ( 98/180) spt-daemon::inject_control_wedge c1_miss_once_preserves_binary_and_next_inject_delivers
2026-07-27T07:19:21.8571058Z         PASS [   3.819s] ( 99/180) spt-daemon::inject_control_wedge c1_strike_fault_stamps_perch_and_bounded_respawns_then_gives_up
2026-07-27T07:19:34.1776860Z         PASS [  12.320s] (100/180) spt-daemon::inject_control_wedge g1_choreography_happy_path_payload_reaches_pty_and_controller_keeps_control
2026-07-27T07:19:35.5924368Z         PASS [   1.415s] (101/180) spt-daemon::inject_control_wedge g2_no_commit_deadline_faults_binary_and_does_not_wedge_controller_input
2026-07-27T07:19:36.3177788Z         PASS [   0.725s] (102/180) spt-daemon::inject_control_wedge g3_content_free_ping_never_duplicates_operator_keystrokes_into_binary
2026-07-27T07:19:37.0217700Z         PASS [   0.704s] (103/180) spt-daemon::inject_control_wedge g4_translation_child_is_reaped_no_zombie_after_session_down
2026-07-27T07:19:39.2084758Z         PASS [   2.187s] (104/180) spt-daemon::inject_control_wedge g5_active_endpoint_spools_deferred_and_is_not_injected
2026-07-27T07:19:39.9282283Z         PASS [   0.720s] (105/180) spt-daemon::inject_control_wedge g6_faulted_inflight_envelope_is_respooled_not_lost
2026-07-27T07:19:52.2455538Z         PASS [  12.317s] (106/180) spt-daemon::inject_control_wedge g7_native_injects_mid_active_bypassing_the_idle_gate
2026-07-27T07:19:53.0376159Z         PASS [   0.792s] (107/180) spt-daemon::inject_control_wedge large_endpoint_inject_to_a_no_binary_session_spools_promptly_without_wedging
2026-07-27T07:19:56.5977334Z         PASS [   3.560s] (108/180) spt-daemon::inject_control_wedge p0_paste_wedge_parked_write_does_not_starve_attach_or_wedge_broker
2026-07-27T07:19:58.2703637Z         PASS [   1.673s] (109/180) spt-daemon::inject_control_wedge parked_message_to_already_idle_endpoint_is_delivered_without_a_poke
2026-07-27T07:19:58.8096356Z         PASS [   0.539s] (110/180) spt-daemon::inject_control_wedge w5_a1_locally_driven_session_reports_controller_by_none
2026-07-27T07:20:03.4297065Z         PASS [   4.620s] (111/180) spt-daemon::inject_control_wedge w5_a2_abandoned_remote_controller_conn_close_eviction_is_platform_divergent
2026-07-27T07:20:03.7161914Z         PASS [   0.286s] (112/180) spt-daemon::inject_control_wedge w5a_bigmultiline_inject_arrives_byte_complete_across_a_loop
2026-07-27T07:20:04.8301899Z         PASS [   1.114s] (113/180) spt-daemon::inject_control_wedge w5a_forced_echo_miss_redrives_once_then_loud_spools
2026-07-27T07:20:17.2728710Z         PASS [  12.443s] (114/180) spt-daemon::inject_control_wedge wan_arrival_to_idle_spt_hosted_injects_with_no_hook_poll
2026-07-27T07:20:49.2432564Z         PASS [  31.970s] (115/180) spt-daemon::input_ack_deadlock input_flood_through_serve_attach_does_not_deadlock_broker
2026-07-27T07:20:49.8407869Z         PASS [   0.597s] (116/180) spt-daemon::mesh_recovery health_degrades_during_all_peer_failure_and_recovers_on_real_progress
2026-07-27T07:20:50.1911568Z         PASS [   0.350s] (117/180) spt-daemon::mesh_recovery poison_cache_row_is_repaired_from_the_roster_at_startup
2026-07-27T07:20:55.6320411Z         PASS [   5.441s] (118/180) spt-daemon::mesh_recovery roster_route_survives_a_transient_dial_failure_with_discovery_disabled
2026-07-27T07:20:58.3159634Z         PASS [   2.684s] (119/180) spt-daemon::net_worker_starve dead_peer_dial_burst_vs_net_runtime_canary
2026-07-27T07:21:00.9804173Z         PASS [   2.664s] (120/180) spt-daemon::net_worker_starve unreachable_peer_dial_burst_vs_net_runtime_canary
2026-07-27T07:21:02.0128392Z         PASS [   1.032s] (121/180) spt-daemon::redispatch finished_historical_attach_neither_takes_nor_clears_current_controller
2026-07-27T07:21:02.4989564Z         PASS [   0.486s] (122/180) spt-daemon::redispatch finished_pending_sync_request_still_serves_across_generation_start
2026-07-27T07:21:04.8727892Z         PASS [   2.374s] (123/180) spt-daemon::redispatch finished_unretired_attach_is_skipped_and_drained_not_replayed
2026-07-27T07:21:05.4626285Z         PASS [   0.590s] (124/180) spt-daemon::redispatch opener_evicted_active_stream_resumes_after_dispatcher_restart
2026-07-27T07:21:06.6540188Z         PASS [   1.191s] (125/180) spt-daemon::redispatch transient_worker_start_failure_recovers_via_claim_retry
2026-07-27T07:21:06.8174660Z         PASS [   0.163s] (126/180) spt-daemon::redispatch_stall old_broker_unknown_verb_answer_falls_back_to_the_peek_and_serves_real_traffic
2026-07-27T07:21:11.8230025Z         PASS [   5.005s] (127/180) spt-daemon::redispatch_stall opener_transient_is_bounded_requeue_never_a_peek_subscriber
2026-07-27T07:21:13.5771115Z         PASS [   1.754s] (128/180) spt-daemon::redispatch_stall poisoned_subscriber_cancels_the_paired_forwarding_leg_then_recovery_serves
2026-07-27T07:21:16.1052326Z         PASS [   2.528s] (129/180) spt-daemon::redispatch_stall seat_blocked_failure_trips_the_breaker_and_the_stream_recovers
2026-07-27T07:21:18.4216500Z         PASS [   2.316s] (130/180) spt-daemon::redispatch_stall stale_unfinished_attach_replay_neither_takes_nor_clears_the_replacement_controller
2026-07-27T07:21:20.5689826Z         PASS [   2.147s] (131/180) spt-daemon::redispatch_stall wedged_subscriber_never_stalls_the_producer_and_recovery_replays_gapless
2026-07-27T07:21:20.7605900Z         PASS [   0.192s] (132/180) spt-daemon::registry_lifecycle multichunk_feed_applies_with_exactly_one_snapshot_write
2026-07-27T07:21:25.6856499Z         PASS [   4.925s] (133/180) spt-daemon::registry_lifecycle oneway_rounds_plateau_rows_seats_and_a_refresh_replays_nothing
2026-07-27T07:21:39.8754215Z         PASS [  14.190s] (134/180) spt-daemon::registry_lifecycle poisoned_registry_replay_strikes_out_terminal_while_fresh_feeds_serve
2026-07-27T07:21:40.2798189Z         PASS [   0.404s] (135/180) spt-daemon::render_lifecycle final_output_frame_precedes_exit_through_the_production_path
2026-07-27T07:21:44.4888103Z         PASS [   4.209s] (136/180) spt-daemon::resize_geometry_epoch a_real_conpty_grow_repaints_cell_for_cell_like_an_independent_authority
2026-07-27T07:21:48.6922405Z         PASS [   4.203s] (137/180) spt-daemon::resize_geometry_epoch a_real_conpty_shrink_repaints_cell_for_cell_like_an_independent_authority
2026-07-27T07:21:56.1403247Z         PASS [   7.448s] (138/180) spt-daemon::resize_presentation_barrier a_controller_resuming_across_the_transition_gets_the_repaint_never_raw
2026-07-27T07:22:03.0580995Z         PASS [   6.918s] (139/180) spt-daemon::resize_presentation_barrier a_live_controller_and_viewer_across_a_shrink_see_one_sync_frame_never_mixed_geometry
2026-07-27T07:22:13.4644702Z         PASS [  10.406s] (140/180) spt-daemon::restart_replay_lifetime a_raw_dead_connection_bound_opener_is_not_re_served_by_the_next_generation
2026-07-27T07:22:15.9170475Z         PASS [   2.452s] (141/180) spt-daemon::resume cold_start_resumes_all_sessions_from_the_broker_cursor
2026-07-27T07:22:20.3337329Z         PASS [   4.417s] (142/180) spt-daemon::resume resume_below_ring_floor_clamps_forward_without_gap_error
2026-07-27T07:22:21.6386870Z         PASS [   1.305s] (143/180) spt-daemon::resume resume_mode_brain_spawning_new_sessions_delivers_each
2026-07-27T07:22:21.8795598Z         PASS [   0.241s] (144/180) spt-daemon::shellchan hung_shell_stalls_no_other_owner
2026-07-27T07:22:22.0397366Z         PASS [   0.160s] (145/180) spt-daemon::shellchan stdin_receipt_delivers_spooled_frames_exactly_once
2026-07-27T07:22:22.1420747Z         PASS [   0.102s] (146/180) spt-daemon::spawn_truth concurrent_fresh_race_yields_one_created_one_conflict
2026-07-27T07:22:22.2041296Z         PASS [   0.062s] (147/180) spt-daemon::spawn_truth fresh_create_over_offline_raw_active_stale_ledger_creates
2026-07-27T07:22:22.2647421Z         PASS [   0.061s] (148/180) spt-daemon::spawn_truth fresh_over_live_is_a_typed_conflict_and_touches_nothing
2026-07-27T07:22:22.3538599Z         PASS [   0.089s] (149/180) spt-daemon::spawn_truth mixed_fresh_resume_race_never_two_children
2026-07-27T07:22:22.3707499Z         PASS [   0.017s] (150/180) spt-daemon::spawn_truth n1_broker_unknown_kind_fails_loud_never_created
2026-07-27T07:22:27.5213306Z         PASS [   5.150s] (151/180) spt-daemon::spawn_truth windows_run_never_refuses_over_a_dead_root_the_broker_holds_a_handle_to
2026-07-27T07:22:27.9542914Z         PASS [   0.433s] (152/180) spt-daemon::spawn_truth zombie_client_tree_is_reaped_and_run_succeeds_honestly
2026-07-27T07:23:27.9606943Z         SLOW [> 60.000s] (───────) spt-daemon::transport_death_eof transport_death_without_a_fin_surfaces_eof_to_the_serving_worker
2026-07-27T07:23:33.4852378Z         PASS [  65.531s] (153/180) spt-daemon::transport_death_eof transport_death_without_a_fin_surfaces_eof_to_the_serving_worker
2026-07-27T07:23:33.6207675Z         PASS [   0.135s] (154/180) spt-daemon::two_origin_spanning digest_span_supersedes_a_replayed_generation
2026-07-27T07:23:33.7816095Z         PASS [   0.161s] (155/180) spt-daemon::two_origin_spanning one_source_two_consumers_spans_and_merges
2026-07-27T07:23:33.7929076Z         PASS [   0.011s] (156/180) spt-daemon::twohost b2_attacher_child
2026-07-27T07:23:33.8023064Z         PASS [   0.009s] (157/180) spt-daemon::twohost two_host_ladder_role_a
2026-07-27T07:23:33.8124002Z         PASS [   0.010s] (158/180) spt-daemon::twohost two_host_ladder_role_b
2026-07-27T07:23:38.8463887Z         PASS [   5.034s] (159/180) spt-term::capture_vehicle_fidelity the_replay_vehicle_is_cell_transparent_with_dnar
2026-07-27T07:23:43.8692377Z         PASS [   5.023s] (160/180) spt-term::capture_vehicle_fidelity the_stock_console_vehicle_manufactures_the_field_string
2026-07-27T07:23:43.9190707Z         PASS [   0.050s] (161/180) spt-term::dsr conpty_output_not_withheld_under_the_drain
2026-07-27T07:23:43.9514517Z         PASS [   0.032s] (162/180) spt-term::dsr drain_forwards_child_output
2026-07-27T07:23:43.9996564Z         PASS [   0.048s] (163/180) spt-term::inject ctrl_c_interrupts_the_child
2026-07-27T07:23:44.0574078Z         PASS [   0.058s] (164/180) spt-term::inject send_line_reaches_child_and_preserves_order
2026-07-27T07:23:44.0803489Z         PASS [   0.023s] (165/180) spt-term::rc_console_newline_presentation a_bare_lf_is_an_index_in_a_spec_vt
2026-07-27T07:23:47.1071857Z         PASS [   3.027s] (166/180) spt-term::rc_console_newline_presentation rc_console_mode_today_column_resets_a_bare_lf
2026-07-27T07:23:50.1263368Z         PASS [   3.019s] (167/180) spt-term::rc_console_newline_presentation rc_console_mode_with_dnar_presents_what_the_emitter_addressed
2026-07-27T07:23:50.3948657Z         PASS [   0.268s] (168/180) spt-term::resize_console_mode_integrity a_surface_resize_does_not_alter_the_hosted_console_input_mode
2026-07-27T07:23:50.4023738Z         PASS [   0.007s] (169/180) spt-term::resize_console_mode_integrity the_probe_report_parses_out_of_a_re_rendered_stream
2026-07-27T07:23:50.5705057Z         PASS [   0.168s] (170/180) spt-term::resize_console_mode_integrity the_rig_detects_a_seeded_console_input_mode_change
2026-07-27T07:23:51.0917926Z         PASS [   0.521s] (171/180) spt-term::resize_console_mode_integrity typed_bytes_do_not_echo_back_as_output_after_a_resize
2026-07-27T07:23:51.1098365Z         PASS [   0.018s] (172/180) spt-term::screengrid_width_oracle combining_mark_zero_cell_survives_the_repaint
2026-07-27T07:23:51.1200763Z         PASS [   0.010s] (173/180) spt-term::screengrid_width_oracle cup_overwrite_after_wide_glyphs_lands_on_the_same_cells
2026-07-27T07:23:51.1275598Z         PASS [   0.007s] (174/180) spt-term::screengrid_width_oracle el_cleared_overflow_row_stays_blank_after_repaint
2026-07-27T07:23:51.1349092Z         PASS [   0.007s] (175/180) spt-term::screengrid_width_oracle ich_dch_erase_across_a_wide_half_leave_no_orphans
2026-07-27T07:23:51.1418418Z         PASS [   0.007s] (176/180) spt-term::screengrid_width_oracle wide_glyph_at_the_margin_fits_exactly_or_wraps_whole
2026-07-27T07:23:52.1718878Z         PASS [   1.030s] (177/180) spt-term::stream bounded_backpressure_stalls_an_unconsumed_reader
2026-07-27T07:23:52.2054798Z         PASS [   0.034s] (178/180) spt-term::stream delivers_every_value_under_resize
2026-07-27T07:23:52.2318566Z         PASS [   0.026s] (179/180) spt-term::surface resize_under_load_does_not_hang_or_panic
2026-07-27T07:23:52.2616477Z         PASS [   0.030s] (180/180) spt-term::winspawn pty_spawns_a_cmd_script_via_cmd_wrap
2026-07-27T07:23:52.2618491Z ────────────
2026-07-27T07:23:52.2618805Z      Summary [ 383.724s] 180 tests run: 160 passed (1 slow), 20 failed, 0 skipped
2026-07-27T07:23:52.2619256Z         FAIL [   8.953s] (  6/180) spt::brain_split seed_anchor_survives_brain_cycle
2026-07-27T07:23:52.2620319Z         FAIL [   0.019s] (  7/180) spt::brain_survive pty_and_quic_survive_brain_process_restart_onto_swapped_binary
2026-07-27T07:23:52.2621032Z         FAIL [   0.018s] (  8/180) spt::daemon_refresh_e2e daemon_refresh_cycles_brain_while_hosted_endpoint_survives
2026-07-27T07:23:52.2621647Z         FAIL [   0.017s] (  9/180) spt::dummy_harness_e2e endpoint_run_attach_awaits_online_before_attaching
2026-07-27T07:23:52.2622278Z         FAIL [   0.016s] ( 10/180) spt::dummy_harness_e2e endpoint_run_brings_up_a_long_lived_dummy_harness_and_rc_attaches
2026-07-27T07:23:52.2622961Z         FAIL [   0.026s] ( 11/180) spt::endpoint_teardown_authority_e2e shutdown_reaps_the_hosted_subtree_it_reports_suspending
2026-07-27T07:23:52.2623444Z         FAIL [   0.017s] ( 12/180) spt::endpoint_teardown_authority_e2e stop_reaps_the_hosted_subtree_and_run_recovers_the_endpoint
2026-07-27T07:23:52.2623928Z         FAIL [   0.018s] ( 16/180) spt::live_adapt_translation_swap_e2e adapter_apply_for_foreign_adapter_leaves_live_endpoint_untouched
2026-07-27T07:23:52.2624427Z         FAIL [   0.011s] ( 17/180) spt::live_adapt_translation_swap_e2e adapter_apply_swaps_composite_profile_endpoint_matched_on_parent
2026-07-27T07:23:52.2624932Z         FAIL [   0.012s] ( 18/180) spt::live_adapt_translation_swap_e2e adapter_apply_swaps_locked_translation_binary_without_restarting_endpoint
2026-07-27T07:23:52.2625422Z         FAIL [   0.018s] ( 20/180) spt::livehost_bootgate_e2e cold_start_does_not_revive_a_sessionless_online_latched_perch
2026-07-27T07:23:52.2625819Z         FAIL [   0.019s] ( 21/180) spt::multi_subnet_bringup_e2e fresh_unbound_is_attachable_before_bind
2026-07-27T07:23:52.2626206Z         FAIL [   0.011s] ( 22/180) spt::multi_subnet_bringup_e2e multi_subnet_refuses_without_subnet_then_homes_and_binds
2026-07-27T07:23:52.2626580Z         FAIL [   0.013s] ( 23/180) spt::multi_subnet_bringup_e2e single_subnet_control_auto_homes
2026-07-27T07:23:52.2626891Z         FAIL [   0.013s] ( 30/180) spt::rc_attach_truth offline_row_over_live_session_attaches
2026-07-27T07:23:52.2627207Z         FAIL [   0.014s] ( 32/180) spt::rc_attach_truth rc_owned_display_carries_no_pump_diagnostics
2026-07-27T07:23:52.2627544Z         FAIL [   0.011s] ( 33/180) spt::rc_attach_truth resume_never_bound_reads_unbound_and_attaches
2026-07-27T07:23:52.2627857Z         FAIL [   0.013s] ( 34/180) spt::rc_attach_truth zombie_claim_refuses_never_attaches
2026-07-27T07:23:52.2628214Z         FAIL [   0.017s] ( 35/180) spt::resume_template_e2e endpoint_run_resume_selects_resume_template_in_recorded_cwd
2026-07-27T07:23:52.2628633Z         FAIL [   0.017s] ( 36/180) spt::run_no_dup_session_e2e run_over_live_endpoint_never_mints_a_second_session
2026-07-27T07:23:52.2671097Z error: test run failed
2026-07-27T07:23:52.3268730Z ##[error]Process completed with exit code 1.
